로그인 영역

통합 검색
통합 검색

젠투 공식 홈페이지
젠투 공식 한글 번역 문서
부 메뉴
  1. 질문/답변
  2. Tips
  3. 위키(새 창)
  4. 뉴스/새소식
컨텐츠 영역

gcc-4.1.2 emerge 실패 ㅠㅠ

2008.06.07 23:04

길혀니 조회 수:14758

emerge -uDN world 하고 업데이트를 하는데
항상 gcc??? 발목을 잡네요;;; 어찌해야 좋을지 고민되네요;;;


현재 gcc버전입니다.
=========================================================================
localhost ~ # gcc --version
gcc (GCC) 4.1.2 (Gentoo 4.1.2 p1.0.2)
Copyright (C) 2006 Free Software Foundation, Inc.
This is free software; see the source for copying conditions. There is NO
warranty; not even for MERCHANTABILITY or FITNESS FOR A PARTICULAR PURPOSE.


이것은 에러화면입니다...
=========================================================================
/var/tmp/portage/sys-devel/gcc-4.1.2/work/gcc-4.1.2/gcc/config/i386/i386.md:207: internal compiler error: 세그멘테이션 오류
Please submit a full bug report,
with preprocessed source if appropriate.
See for instructions.
The bug is not reproducible, so it is likely a hardware or OS problem.
make[2]: *** [insn-attrtab.o] 오류 1
make[2]: Leaving directory `/var/tmp/portage/sys-devel/gcc-4.1.2/work/build/gcc'
make[1]: *** [stage1_build] 오류 2
make[1]: Leaving directory `/var/tmp/portage/sys-devel/gcc-4.1.2/work/build/gcc'
make: *** [profiledbootstrap] 오류 2
*
* ERROR: sys-devel/gcc-4.1.2 failed.
* Call stack:
* ebuild.sh, line 49: Called src_compile
* environment, line 4539: Called toolchain_src_compile
* environment, line 5010: Called gcc_src_compile
* environment, line 2903: Called gcc_do_make
* environment, line 2733: Called die
* The specific snippet of code:
* emake LDFLAGS="${LDFLAGS}" STAGE1_CFLAGS="${STAGE1_CFLAGS}" LIBPATH="${LIBPATH}" BOOT_CFLAGS="${BOOT_CFLAGS}" ${GCC_MAKE_TARGET} || die "emake failed with ${GCC_MAKE_TARGET}";
* The die message:
* emake failed with profiledbootstrap
*
* If you need support, post the topmost build error, and the call stack if relevant.
* A complete build log is located at '/var/tmp/portage/sys-devel/gcc-4.1.2/temp/build.log'.
* The ebuild environment file is located at '/var/tmp/portage/sys-devel/gcc-4.1.2/temp/environment'.
*

* Messages for package sys-devel/gcc-4.1.2:

*
* ERROR: sys-devel/gcc-4.1.2 failed.
* Call stack:
* ebuild.sh, line 49: Called src_compile
* environment, line 4539: Called toolchain_src_compile
* environment, line 5010: Called gcc_src_compile
* environment, line 2903: Called gcc_do_make
* environment, line 2733: Called die
* The specific snippet of code:
* emake LDFLAGS="${LDFLAGS}" STAGE1_CFLAGS="${STAGE1_CFLAGS}" LIBPATH="${LIBPATH}" BOOT_CFLAGS="${BOOT_CFLAGS}" ${GCC_MAKE_TARGET} || die "emake failed with ${GCC_MAKE_TARGET}";
* The die message:
* emake failed with profiledbootstrap
*
* If you need support, post the topmost build error, and the call stack if relevant.
* A complete build log is located at '/var/tmp/portage/sys-devel/gcc-4.1.2/temp/build.log'.
* The ebuild environment file is located at '/var/tmp/portage/sys-devel/gcc-4.1.2/temp/environment'.
*