로그인 영역

통합 검색
통합 검색

젠투 공식 홈페이지
젠투 공식 한글 번역 문서
부 메뉴
  1. 질문/답변
  2. Tips
  3. 위키(새 창)
  4. 뉴스/새소식
컨텐츠 영역

emerge 사용시 에러에러인데요

2008.09.05 01:35

김재훈 조회 수:12405

emerge로 셋팅중인데요....
커널 이미지 생성 이후부터 이런 메세지가 나오네요
커널 이미지 생성시 다른 특별한거 한것은 없고요
# make bzImage
# cp arch/i386/boot/bzImage /boot/bzImage-2.6.23
# make modules
# make modules_install
이렇게만 설치 하였습니다.

/usr/bin/xgettext: error while loading shared libraries: libexpat.so.0:
cannot open shared object file: No such file or directory
gmake[1]: *** [attr.pot] Error 127
make: *** [default] Error 2
*
* ERROR: sys-apps/attr-2.4.41 failed.
* Call stack:
* ebuild.sh, line 49: Called src_compile
* environment, line 2492: Called die
* The specific snippet of code:
* emake || die
* The die message:
* (no error message)
*
* If you need support, post the topmost build error, and the call stack
if relevant.
* A complete build log is located at '/var/tmp/portage/sys-apps/attr-
2.4.41/temp/build.log'.
* The ebuild environment file is located at '/var/tmp/portage/sys-
apps/attr-2.4.41/temp/environment'.
*


* Messages for package sys-apps/attr-2.4.41:


*
* ERROR: sys-apps/attr-2.4.41 failed.
* Call stack:
* ebuild.sh, line 49: Called src_compile
* environment, line 2492: Called die
* The specific snippet of code:
* emake || die
* The die message:
* (no error message)
*
* If you need support, post the topmost build error, and the call stack
if relevant.
* A complete build log is located at '/var/tmp/portage/sys-apps/attr-
2.4.41/temp/build.log'.
* The ebuild environment file is located at '/var/tmp/portage/sys-
apps/attr-2.4.41/temp/environment'.


이런 메???지가 emerge를 할때 마다 나오는데....


gentoo bug에서 찾아봐도 잘 안 되네요....


혹시 아시는분 계시면 좀 도와주세요.....ㅠㅠ